Reaction Details
TargetSodium-dependent serotonin transporter
LigandBDBM50010195
Substrate/Competitorn/a
Meas. Tech.ChEMBL_201518 (CHEMBL807135)
IC50 4.21±n/a nM
Citation Holmquist, CRKeverline-Frantz, KIAbraham, PBoja, JWKuhar, MJCarroll, FI 3 alpha-(4'-substituted phenyl)tropane-2 beta-carboxylic acid methyl esters: novel ligands with high affinity and selectivity at the dopamine transporter. J Med Chem39:4139-41 (1996) 
 
Sodium-dependent serotonin transporter
Name:Sodium-dependent serotonin transporter
Type:Multi-pass membrane protein
Mol. Mass.:70168.43
Organism:Rattus norvegicus (rat)
Description:P31652
Residue:630
BDBM50010195
NameBDBM50010195
Synonyms:(3S,5R)-methyl 3-(4-iodophenyl)-8-methyl-8-aza-bicyclo[3.2.1]octane-2-carboxylate 3-(4-Iodo-phenyl)-8-methyl-8-aza-bicyclo[3.2.1]octane-2-carboxylic acid methyl ester | CHEMBL14391
TypeSmall organic molecule
Emp. Form.C16H20INO2
Mol. Mass.385.24
SMILESCOC(=O)C1C2CCC(CC1c1ccc(I)cc1)N2C