Reaction Details
TargetAdenosylhomocysteinase
LigandBDBM85777
Substrate/Competitorn/a
Meas. Tech.ChEMBL_196742 (CHEMBL857626)
Ki 43400±n/a nM
Citation Wnuk, SFLiu, SYuan, CSBorchardt, RTRobins, MJ Inactivation of S-adenosyl-L-homocysteine hydrolase by amide and ester derivatives of adenosine-5'-carboxylic acid. J Med Chem39:4162-6 (1996) 
 
Adenosylhomocysteinase
Name:Adenosylhomocysteinase
Type:PROTEIN
Mol. Mass.:47714.06
Organism:Homo sapiens (Human)
Description:ChEMBL_1507791
Residue:432
BDBM85777
NameBDBM85777
Synonyms:B-NECA
TypeSmall organic molecule
Emp. Form.C17H18N6O4
Mol. Mass.370.3626
SMILESNc1ncnc2n(cnc12)[C@@H]1O[C@@H]([C@@H](O)[C@H]1O)C(=O)NCc1ccccc1