Reaction Details
TargetRibonucleoside-diphosphate reductase large subunit/subunit M2
LigandBDBM50033462
Substrate/Competitorn/a
Meas. Tech.ChEMBL_195256 (CHEMBL872978)
IC50 24±n/a nM
Citation Moss, NBeaulieu, PDuceppe, JSFerland, JMGarneau, MGauthier, JGhiro, EGoulet, SGuse, IJaramillo, JLlinas-Brunet, MMalenfant, EPlante, RPoirier, MSoucy, FWernic, DYoakim, CDéziel, R Peptidomimetic inhibitors of herpes simplex virus ribonucleotide reductase with improved in vivo antiviral activity. J Med Chem39:4173-80 (1996) 
 
Ribonucleoside-diphosphate reductase large subunit/subunit M2
Name:Ribonucleoside-diphosphate reductase large subunit/subunit M2
Type:Enzyme
Mol. Mass.:n/a
Description:n/a
Components:This complex has 2 components.
Component 1
Name:Ribonucleoside-diphosphate reductase large subunit
Synonyms:RIR1_HUMAN RRM1 Ribonucleoside-diphosphate reductase subunit M1 | Ribonucleotide reductase large subunit
Type:PROTEIN
Mol. Mass.:90074.67
Organism:Homo sapiens (Human)
Description:ChEMBL_90946
Residue:792
Component 2
Name:Ribonucleoside-diphosphate reductase subunit M2
Synonyms:RIR2_HUMAN RRM2 Ribonucleotide reductase small chain | Ribonucleotide reductase small subunit
Type:PROTEIN
Mol. Mass.:44868.59
Organism:Homo sapiens (Human)
Description:ChEMBL_195255
Residue:389
BDBM50033462
NameBDBM50033462
Synonyms:(S)-2-[(S)-3-Carboxy-2-((S)-2-{(S)-3-methyl-2-[(S)-3-methyl-2-(3-phenyl-propionylamino)-butyrylamino]-butyrylamino}-4-oxo-4-pyrrolidin-1-yl-butyrylamino)-propionylamino]-4-methyl-pentanoic acid | CHEMBL305229
TypeSmall organic molecule
Emp. Form.C37H56N6O10
Mol. Mass.744.8747
SMILESCC(C)C[C@H](NC(=O)[C@H](CC(O)=O)NC(=O)[C@H](CC(=O)N1CCCC1)NC(=O)[C@@H](NC(=O)[C@@H](NC(=O)CCc1ccccc1)C(C)C)C(C)C)C(O)=O