Reaction Details
TargetRibonucleoside-diphosphate reductase large subunit/subunit M2
LigandBDBM50369165
Substrate/Competitorn/a
Meas. Tech.ChEMBL_195256 (CHEMBL872978)
IC50 20±n/a nM
Citation Moss, NBeaulieu, PDuceppe, JSFerland, JMGarneau, MGauthier, JGhiro, EGoulet, SGuse, IJaramillo, JLlinas-Brunet, MMalenfant, EPlante, RPoirier, MSoucy, FWernic, DYoakim, CDéziel, R Peptidomimetic inhibitors of herpes simplex virus ribonucleotide reductase with improved in vivo antiviral activity. J Med Chem39:4173-80 (1996) 
 
Ribonucleoside-diphosphate reductase large subunit/subunit M2
Name:Ribonucleoside-diphosphate reductase large subunit/subunit M2
Type:Enzyme
Mol. Mass.:n/a
Description:n/a
Components:This complex has 2 components.
Component 1
Name:Ribonucleoside-diphosphate reductase large subunit
Synonyms:RIR1_HUMAN RRM1 Ribonucleoside-diphosphate reductase subunit M1 | Ribonucleotide reductase large subunit
Type:PROTEIN
Mol. Mass.:90074.67
Organism:Homo sapiens (Human)
Description:ChEMBL_90946
Residue:792
Component 2
Name:Ribonucleoside-diphosphate reductase subunit M2
Synonyms:RIR2_HUMAN RRM2 Ribonucleotide reductase small chain | Ribonucleotide reductase small subunit
Type:PROTEIN
Mol. Mass.:44868.59
Organism:Homo sapiens (Human)
Description:ChEMBL_195255
Residue:389
BDBM50369165
NameBDBM50369165
Synonyms:CHEMBL1169532
TypeSmall organic molecule
Emp. Form.C32H54N6O9
Mol. Mass.666.806
SMILESCC(C)C[C@@H](NC(=O)[C@@H](CC(O)=O)NC(=O)[C@H](CC(=O)N1CCCC1)NC(=O)[C@H](NC(=O)NC1[C@@H](C)CCC[C@@H]1C)C(C)C)C(O)=O