Reaction Details
TargetAdenosine receptor A2a
LigandBDBM50454091
Substrate/Competitorn/a
Meas. Tech.ChEMBL_31064 (CHEMBL641348)
Ki 1.2±n/a nM
Citation Vittori, SCamaioni, EDi Francesco, EVolpini, RMonopoli, ADionisotti, SOngini, ECristalli, G 2-alkenyl and 2-alkyl derivatives of adenosine and adenosine-5'-N-ethyluronamide: different affinity and selectivity of E- and Z-diastereomers at A2A adenosine receptors. J Med Chem39:4211-7 (1996) 
 
Adenosine receptor A2a
Name:Adenosine receptor A2a
Type:G Protein-Coupled Receptor (GPCR)
Mol. Mass.:45015.65
Organism:Rattus norvegicus (rat)
Description:Rat A2A receptors expressed in CHO cells.
Residue:410
BDBM50454091
NameBDBM50454091
Synonyms:CHEMBL2113450
TypeSmall organic molecule
Emp. Form.C23H26N6O4
Mol. Mass.450.4903
SMILESCCNC(=O)[C@H]1O[C@H]([C@H](O)[C@@H]1O)n1cnc2c(N)nc(nc12)C#CCCCc1ccccc1