Reaction Details
TargetAdenosine receptor A2a
LigandBDBM50453224
Substrate/Competitorn/a
Meas. Tech.ChEMBL_30899 (CHEMBL645502)
EC50 596±n/a nM
Citation Vittori, SCamaioni, EDi Francesco, EVolpini, RMonopoli, ADionisotti, SOngini, ECristalli, G 2-alkenyl and 2-alkyl derivatives of adenosine and adenosine-5'-N-ethyluronamide: different affinity and selectivity of E- and Z-diastereomers at A2A adenosine receptors. J Med Chem39:4211-7 (1996) 
 
Adenosine receptor A2a
Name:Adenosine receptor A2a
Type:G Protein-Coupled Receptor (GPCR)
Mol. Mass.:45015.65
Organism:Rattus norvegicus (rat)
Description:Rat A2A receptors expressed in CHO cells.
Residue:410
BDBM50453224
NameBDBM50453224
Synonyms:2-(l-hexyn-l-yl)-adenosine-5'-N-methyluronamide (16c) | CHEMBL410873
TypeSmall organic molecule
Emp. Form.C18H24N6O4
Mol. Mass.388.421
SMILESCCCCC#Cc1nc(N)c2ncn([C@@H]3O[C@@H]([C@@H](O)[C@H]3O)C(=O)NCC)c2n1