Reaction Details
TargetD(3) dopamine receptor
LigandBDBM50115277
Substrate/Competitorn/a
Meas. Tech.ChEMBL_62265 (CHEMBL675667)
Ki 0.54±n/a nM
Citation van Vliet, LATepper, PGDijkstra, DDamsma, GWikström, HPugsley, TAAkunne, HCHeffner, TGGlase, SAWise, LD Affinity for dopamine D2, D3, and D4 receptors of 2-aminotetralins. Relevance of D2 agonist binding for determination of receptor subtype selectivity. J Med Chem39:4233-7 (1996) 
 
D(3) dopamine receptor
Name:D(3) dopamine receptor
Type:n/a
Mol. Mass.:44243.43
Organism:Homo sapiens (Human)
Description:n/a
Residue:400
BDBM50115277
NameBDBM50115277
Synonyms:(2R,3R)-6-Dipropylamino-5,6,7,8-tetrahydro-naphthalen-1-ol (2S)-6-Dipropylamino-5,6,7,8-tetrahydro-naphthalen-1-ol (S)-(-)-5-hydroxy-2-(N,N-di-n-propylamino)tetralin (S)-6-Dipropylamino-5,6,7,8-tetrahydro-naphthalen-1-ol.HCl CHEMBL269004
TypeSmall organic molecule
Emp. Form.C16H25NO
Mol. Mass.247.3758
SMILESCCCN(CCC)[C@H]1CCc2c(O)cccc2C1