Reaction Details
TargetD(3) dopamine receptor
LigandBDBM50369174
Substrate/Competitorn/a
Meas. Tech.ChEMBL_62265 (CHEMBL675667)
Ki 1.1±n/a nM
Citation van Vliet, LATepper, PGDijkstra, DDamsma, GWikström, HPugsley, TAAkunne, HCHeffner, TGGlase, SAWise, LD Affinity for dopamine D2, D3, and D4 receptors of 2-aminotetralins. Relevance of D2 agonist binding for determination of receptor subtype selectivity. J Med Chem39:4233-7 (1996) 
 
D(3) dopamine receptor
Name:D(3) dopamine receptor
Type:n/a
Mol. Mass.:44243.43
Organism:Homo sapiens (Human)
Description:n/a
Residue:400
BDBM50369174
NameBDBM50369174
Synonyms:CHEMBL94015 | PD-128907
TypeSmall organic molecule
Emp. Form.C14H19NO3
Mol. Mass.249.3056
SMILESCCCN1COC[C@H]2[C@H]1COc1ccc(O)cc21