Reaction Details
TargetD(3) dopamine receptor
LigandBDBM50010621
Substrate/Competitorn/a
Meas. Tech.ChEMBL_62265 (CHEMBL675667)
Ki 1.8±n/a nM
Citation van Vliet, LATepper, PGDijkstra, DDamsma, GWikström, HPugsley, TAAkunne, HCHeffner, TGGlase, SAWise, LD Affinity for dopamine D2, D3, and D4 receptors of 2-aminotetralins. Relevance of D2 agonist binding for determination of receptor subtype selectivity. J Med Chem39:4233-7 (1996) 
 
D(3) dopamine receptor
Name:D(3) dopamine receptor
Type:n/a
Mol. Mass.:44243.43
Organism:Homo sapiens (Human)
Description:n/a
Residue:400
BDBM50010621
NameBDBM50010621
Synonyms:6-[Propyl-(2-thiophen-3-yl-ethyl)-amino]-5,6,7,8-tetrahydro-naphthalen-1-ol | CHEMBL7806
TypeSmall organic molecule
Emp. Form.C19H25NOS
Mol. Mass.315.473
SMILESCCCN(CCc1ccsc1)C1CCc2c(O)cccc2C1