Reaction Details
TargetD(1A) dopamine receptor
LigandBDBM50054088
Substrate/Competitorn/a
Meas. Tech.ChEMBL_58656 (CHEMBL670430)
Ki 0.90±n/a nM
Citation Claudi, FCingolani, GMDi Stefano, AGiorgioni, GAmenta, FBarili, PFerrari, FGiuliani, D Synthesis, resolution, and preliminary evaluation of trans-2-amino-6(5)-hydroxy-1-phenyl-2,3-dihydro-1H-indenes and related derivatives as dopamine receptors ligands. J Med Chem39:4238-46 (1996) 
 
D(1A) dopamine receptor
Name:D(1A) dopamine receptor
Type:Enzyme Catalytic Domain
Mol. Mass.:49429.75
Organism:RAT
Description:P18901
Residue:446
BDBM50054088
NameBDBM50054088
Synonyms:(2R,3R)-2-(Methyl-propyl-amino)-3-phenyl-indan-5-ol | CHEMBL433652
TypeSmall organic molecule
Emp. Form.C19H23NO
Mol. Mass.281.392
SMILESCCCN(C)[C@@H]1Cc2ccc(O)cc2[C@H]1c1ccccc1