Reaction Details
TargetAcetylcholinesterase
LigandBDBM50422179
Substrate/Competitorn/a
Meas. Tech.ChEMBL_27801 (CHEMBL636511)
Ki 9.5±n/a nM
Citation Inoue, AKawai, TWakita, MIimura, YSugimoto, HKawakami, Y The simulated binding of (+/-)-2,3-dihydro-5,6-dimethoxy-2-[[1-(phenylmethyl)-4-piperidinyl]meth yl] -1H-inden-1-one hydrochloride (E2020) and related inhibitors to free and acylated acetylcholinesterases and corresponding structure-activity analyses. J Med Chem39:4460-70 (1996) 
 
Acetylcholinesterase
Name:Acetylcholinesterase
Type:n/a
Mol. Mass.:65900.74
Organism:Tetronarce californica (Pacific electric ray) (Torpedo californica)
Description:P04058
Residue:586
BDBM50422179
NameBDBM50422179
Synonyms:CHEMBL2093912
TypeSmall organic molecule
Emp. Form.C24H29NO3
Mol. Mass.379.492
SMILESCOc1cc2C[C@H](CC3CCN(Cc4ccccc4)CC3)C(=O)c2cc1OC