Reaction Details
TargetDihydroorotate dehydrogenase (quinone), mitochondrial
LigandBDBM50054600
Substrate/Competitorn/a
Meas. Tech.ChEMBL_52874 (CHEMBL666233)
IC50 23±n/a nM
Citation Kuo, EAHambleton, PTKay, DPEvans, PLMatharu, SSLittle, EMcDowall, NJones, CBHedgecock, CJYea, CMChan, AWHairsine, PWAger, IRTully, WRWilliamson, RAWestwood, R Synthesis, structure-activity relationships, and pharmacokinetic properties of dihydroorotate dehydrogenase inhibitors: 2-cyano-3-cyclopropyl-3-hydroxy-N-[3'-methyl-4'-(trifluoromethyl)phenyl ] propenamide and related compounds. J Med Chem39:4608-21 (1996) 
 
Dihydroorotate dehydrogenase (quinone), mitochondrial
Name:Dihydroorotate dehydrogenase (quinone), mitochondrial
Type:Enzyme
Mol. Mass.:42672.97
Organism:Rattus norvegicus (rat)
Description:The enzyme assay was performed with the histidine-tagged enzyme without cleavage of the tag.
Residue:395
BDBM50054600
NameBDBM50054600
Synonyms:(Z)-2-Cyano-3-hydroxy-penta-2,4-dienoic acid (4-trifluoromethyl-phenyl)-amide CHEMBL141047
TypeSmall organic molecule
Emp. Form.C13H9F3N2O2
Mol. Mass.282.218
SMILESFC(F)(F)c1ccc(NC(=O)C(C#N)C(=O)C=C)cc1