Reaction Details
TargetAdenosine receptor A3
LigandBDBM50054670
Substrate/Competitorn/a
Meas. Tech.ChEMBL_31859 (CHEMBL643936)
Ki 286±n/a nM
Citation Jiang, JLvan Rhee, AMMelman, NJi, XDJacobson, KA 6-phenyl-1,4-dihydropyridine derivatives as potent and selective A3 adenosine receptor antagonists. J Med Chem39:4667-75 (1996) 
 
Adenosine receptor A3
Name:Adenosine receptor A3
Type:G Protein-Coupled Receptor (GPCR)
Mol. Mass.:36197.32
Organism:Homo sapiens (Human)
Description:P0DMS8
Residue:318
BDBM50054670
NameBDBM50054670
Synonyms:2-Methyl-4-[(E)-2-(4-nitro-phenyl)-vinyl]-6-phenyl-1,4-dihydro-pyridine-3,5-dicarboxylic acid 3-benzyl ester 5-ethyl ester | CHEMBL143938
TypeSmall organic molecule
Emp. Form.C31H28N2O6
Mol. Mass.524.5638
SMILESCCO\C([O-])=C1\C(\C=C\c2ccc(cc2)[N+]([O-])=O)C(C(=[OH+])OCc2ccccc2)=C(C)N=C1c1ccccc1