Reaction Details
TargetAdenosine receptor A3
LigandBDBM50054666
Substrate/Competitorn/a
Meas. Tech.ChEMBL_31859 (CHEMBL643936)
Ki 1750±n/a nM
Citation Jiang, JLvan Rhee, AMMelman, NJi, XDJacobson, KA 6-phenyl-1,4-dihydropyridine derivatives as potent and selective A3 adenosine receptor antagonists. J Med Chem39:4667-75 (1996) 
 
Adenosine receptor A3
Name:Adenosine receptor A3
Type:G Protein-Coupled Receptor (GPCR)
Mol. Mass.:36197.32
Organism:Homo sapiens (Human)
Description:P0DMS8
Residue:318
BDBM50054666
NameBDBM50054666
Synonyms:2,4-Dimethyl-6-phenyl-1,4-dihydro-pyridine-3,5-dicarboxylic acid 5-benzyl ester 3-ethyl ester | CHEMBL337552
TypeSmall organic molecule
Emp. Form.C24H25NO4
Mol. Mass.391.4596
SMILESCCOC(=O)C1C(C)C(C(=O)OCc2ccccc2)=C(N=C1C)c1ccccc1