Reaction Details
TargetAdenosine receptor A1
LigandBDBM50054673
Substrate/Competitorn/a
Meas. Tech.ChEMBL_29147 (CHEMBL639427)
Ki 2490±n/a nM
Citation Jiang, JLvan Rhee, AMMelman, NJi, XDJacobson, KA 6-phenyl-1,4-dihydropyridine derivatives as potent and selective A3 adenosine receptor antagonists. J Med Chem39:4667-75 (1996) 
 
Adenosine receptor A1
Name:Adenosine receptor A1
Type:Protein
Mol. Mass.:36704.13
Organism:Rattus norvegicus (rat)
Description:n/a
Residue:326
BDBM50054673
NameBDBM50054673
Synonyms:2-Methyl-6-phenyl-4-((E)-styryl)-pyridine-3,5-dicarboxylic acid diethyl ester | CHEMBL108753
TypeSmall organic molecule
Emp. Form.C26H25NO4
Mol. Mass.415.481
SMILESCCOC(=O)c1c(C)nc(-c2ccccc2)c(C(=O)OCC)c1\C=C\c1ccccc1