Reaction Details
TargetGlucocorticoid receptor
LigandBDBM50054962
Substrate/Competitorn/a
Meas. Tech.ChEMBL_71419 (CHEMBL685137)
IC50 3.3±n/a nM
Citation Ashton, MJLawrence, CKarlsson, JAStuttle, KANewton, CGVacher, BYWebber, SWithnall, MJ Anti-inflammatory 17beta-thioalkyl-16alpha,17alpha-ketal and -acetal androstanes: a new class of airway selective steroids for the treatment of asthma. J Med Chem39:4888-96 (1997) 
 
Glucocorticoid receptor
Name:Glucocorticoid receptor
Type:Enzyme Catalytic Domain
Mol. Mass.:87556.83
Organism:RAT
Description:Glucocorticoid 0 RAT::P06536
Residue:795
BDBM50054962
NameBDBM50054962
Synonyms:(4aS,4bR,5S,6aS,6bR,8R,9aR)-4b-Fluoro-6b-fluoromethylsulfanyl-5-hydroxy-4a,6a-dimethyl-8-propyl-4a,4b,5,6,6a,6b,9a,10,10a,10b,11,12-dodecahydro-7,9-dioxa-pentaleno[2,1-a]phenanthren-2-one | CHEMBL344512
TypeSmall organic molecule
Emp. Form.C24H32F2O4S
Mol. Mass.454.57
SMILESCCC[C@@H]1O[C@@H]2CC3C4CCC5=CC(=O)C=C[C@]5(C)[C@@]4(F)[C@@H](O)C[C@]3(C)[C@@]2(O1)SCF