Reaction Details
TargetGlucocorticoid receptor
LigandBDBM50407989
Substrate/Competitorn/a
Meas. Tech.ChEMBL_71419 (CHEMBL685137)
IC50 4.3±n/a nM
Citation Ashton, MJLawrence, CKarlsson, JAStuttle, KANewton, CGVacher, BYWebber, SWithnall, MJ Anti-inflammatory 17beta-thioalkyl-16alpha,17alpha-ketal and -acetal androstanes: a new class of airway selective steroids for the treatment of asthma. J Med Chem39:4888-96 (1997) 
 
Glucocorticoid receptor
Name:Glucocorticoid receptor
Type:Enzyme Catalytic Domain
Mol. Mass.:87556.83
Organism:RAT
Description:Glucocorticoid 0 RAT::P06536
Residue:795
BDBM50407989
NameBDBM50407989
Synonyms:CHEMBL2112850
TypeSmall organic molecule
Emp. Form.C23H29F3O4S
Mol. Mass.458.534
SMILESCC1(C)O[C@@H]2C[C@H]3[C@@H]4C[C@H](F)C5=CC(=O)C=C[C@]5(C)[C@@]4(F)[C@@H](O)C[C@]3(C)[C@@]2(O1)SCF