Reaction Details
TargetNitric oxide synthase, inducible
LigandBDBM50063300
Substrate/Competitorn/a
Meas. Tech.ChEMBL_89195 (CHEMBL878597)
IC50 4600±n/a nM
Citation Moore, WMWebber, RKFok, KFJerome, GMConnor, JRManning, PTWyatt, PSMisko, TPTjoeng, FSCurrie, MG 2-Iminopiperidine and other 2-iminoazaheterocycles as potent inhibitors of human nitric oxide synthase isoforms. J Med Chem39:669-72 (1996) 
 
Nitric oxide synthase, inducible
Name:Nitric oxide synthase, inducible
Type:Homodimer
Mol. Mass.:131141.95
Organism:Homo sapiens (Human)
Description:P35228
Residue:1153
BDBM50063300
NameBDBM50063300
Synonyms:(L-N6-1-iminoethyl)lysine 6-Acetimidoylamino-2-amino-hexanoic acid CHEMBL7889 N~6~-[(1Z)-ethanimidoyl]-L-lysine | l-NIL
TypeSmall organic molecule
Emp. Form.C8H17N3O2
Mol. Mass.187.2395
SMILESCC(N)=NCCCC[C@H](N)C(O)=O