Reaction Details
TargetNitric oxide synthase, inducible
LigandBDBM50049251
Substrate/Competitorn/a
Meas. Tech.ChEMBL_89195 (CHEMBL878597)
IC50 26000±n/a nM
Citation Moore, WMWebber, RKFok, KFJerome, GMConnor, JRManning, PTWyatt, PSMisko, TPTjoeng, FSCurrie, MG 2-Iminopiperidine and other 2-iminoazaheterocycles as potent inhibitors of human nitric oxide synthase isoforms. J Med Chem39:669-72 (1996) 
 
Nitric oxide synthase, inducible
Name:Nitric oxide synthase, inducible
Type:Homodimer
Mol. Mass.:131141.95
Organism:Homo sapiens (Human)
Description:P35228
Residue:1153
BDBM50049251
NameBDBM50049251
Synonyms:CHEMBL161318 Pyrrolidin-(2Z)-ylideneamine
TypeSmall organic molecule
Emp. Form.C4H8N2
Mol. Mass.84.1197
SMILESNC1=NCCC1