Reaction Details
Target5-hydroxytryptamine receptor 1A
LigandBDBM50051263
Substrate/Competitorn/a
Meas. Tech.ChEMBL_862 (CHEMBL615918)
IC50 4.2±n/a nM
Citation Norman, MHRigdon, GCHall, WRNavas, F Structure-activity relationships of a series of substituted benzamides: potent D2/5-HT2 antagonists and 5-HT1a agonists as neuroleptic agents. J Med Chem39:1172-88 (1996) 
 
5-hydroxytryptamine receptor 1A
Name:5-hydroxytryptamine receptor 1A
Type:G Protein-Coupled Receptor (GPCR)
Mol. Mass.:46445.29
Organism:Rattus norvegicus (rat)
Description:Binding assays were performed using rat hippocampal membranes.
Residue:422
BDBM50051263
NameBDBM50051263
Synonyms:2-Amino-N-[4-(4-benzo[d]isothiazol-3-yl-piperazin-1-yl)-butyl]-6-fluoro-benzamide; hydrochloride | CHEMBL537713
TypeSmall organic molecule
Emp. Form.C22H26FN5OS
Mol. Mass.427.538
SMILESNc1cccc(F)c1C(=O)NCCCCN1CCN(CC1)c1nsc2ccccc12