Reaction Details
TargetMu-type opioid receptor
LigandBDBM50369223
Substrate/Competitorn/a
Meas. Tech.ChEMBL_145275 (CHEMBL751211)
Ki 286±n/a nM
Citation Chang, ACChao, CCTakemori, AEGekker, GHu, SPeterson, PKPortoghese, PS Arylacetamide-derived fluorescent probes: synthesis, biological evaluation, and direct fluorescent labeling of kappa opioid receptors in mouse microglial cells. J Med Chem39:1729-35 (1996) 
 
Mu-type opioid receptor
Name:Mu-type opioid receptor
Type:Enzyme Catalytic Domain
Mol. Mass.:11165.58
Organism:GUINEA PIG
Description:P97266
Residue:98
BDBM50369223
NameBDBM50369223
Synonyms:CHEMBL1907788
TypeSmall organic molecule
Emp. Form.C44H39Cl2N5O7S
Mol. Mass.852.781
SMILES[#6]-[#7](-[#6@H](-[#6]-[#7]-1-[#6]-[#6]-[#6]-[#6]-1)-c1cccc(-[#7]-[#6](=O)-[#6]-[#7]-[#6](=S)-[#7]=[#6]-2-[#6]=[#6]\[#6](-[#6](=[#6]-2)-[#6](-[#8])=O)=[#6]-2\c3ccc(-[#8])cc3-[#8]-c3cc(-[#8])ccc-23)c1)-[#6](=O)-[#6]-c1ccc(Cl)c(Cl)c1