Reaction Details
TargetKappa-type opioid receptor
LigandBDBM50050755
Substrate/Competitorn/a
Meas. Tech.ChEMBL_145552 (CHEMBL751016)
IC50 13±n/a nM
Citation Chang, ACChao, CCTakemori, AEGekker, GHu, SPeterson, PKPortoghese, PS Arylacetamide-derived fluorescent probes: synthesis, biological evaluation, and direct fluorescent labeling of kappa opioid receptors in mouse microglial cells. J Med Chem39:1729-35 (1996) 
 
Kappa-type opioid receptor
Name:Kappa-type opioid receptor
Type:Enzyme
Mol. Mass.:42656.78
Organism:Mus musculus (Mouse)
Description:P33534
Residue:380
BDBM50050755
NameBDBM50050755
Synonyms:5-{3-[4-(1-{[2-(3,4-Dichloro-phenyl)-acetyl]-methyl-amino}-2-pyrrolidin-1-yl-ethyl)-phenyl]-thioureido}-2-(6-hydroxy-3-oxo-3H-xanthen-9-yl)-benzoic acid; compound with triethyl-amine | CHEMBL430971
TypeSmall organic molecule
Emp. Form.C42H36Cl2N4O6S
Mol. Mass.795.729
SMILESCN(C(CN1CCCC1)c1ccc(NC(=S)Nc2ccc(c(c2)C(O)=O)-c2c3ccc(O)cc3oc3cc(=O)ccc23)cc1)C(=O)Cc1ccc(Cl)c(Cl)c1