Reaction Details
TargetKappa-type opioid receptor
LigandBDBM50369225
Substrate/Competitorn/a
Meas. Tech.ChEMBL_145552 (CHEMBL751016)
IC50 1.2±n/a nM
Citation Chang, ACChao, CCTakemori, AEGekker, GHu, SPeterson, PKPortoghese, PS Arylacetamide-derived fluorescent probes: synthesis, biological evaluation, and direct fluorescent labeling of kappa opioid receptors in mouse microglial cells. J Med Chem39:1729-35 (1996) 
 
Kappa-type opioid receptor
Name:Kappa-type opioid receptor
Type:Enzyme
Mol. Mass.:42656.78
Organism:Mus musculus (Mouse)
Description:P33534
Residue:380
BDBM50369225
NameBDBM50369225
Synonyms:CHEMBL1907786
TypeSmall organic molecule
Emp. Form.C42H36Cl2N4O6S
Mol. Mass.795.729
SMILESCN([C@H](CN1CCCC1)c1cccc(NC(=S)Nc2ccc(c(c2)C(O)=O)-c2c3ccc(O)cc3oc3cc(=O)ccc23)c1)C(=O)Cc1ccc(Cl)c(Cl)c1