Reaction Details
TargetProgesterone receptor
LigandBDBM50049503
Substrate/Competitorn/a
Meas. Tech.ChEMBL_159731 (CHEMBL766188)
Ki 31±n/a nM
Citation Hamann, LGFarmer, LJJohnson, MGBender, SLMais, DEWang, MWCrombie, DGoldman, MEJones, TK Synthesis and biological activity of novel nonsteroidal progesterone receptor antagonists based on cyclocymopol monomethyl ether. J Med Chem39:1778-89 (1996) 
 
Progesterone receptor
Name:Progesterone receptor
Type:Protein
Mol. Mass.:98979.52
Organism:Homo sapiens (Human)
Description:P06401
Residue:933
BDBM50049503
NameBDBM50049503
Synonyms:5-Bromo-4-methoxy-2-(4,6,6-trimethyl-2-methylene-cyclohex-3-enylmethyl)-phenol | CHEMBL48746
TypeSmall organic molecule
Emp. Form.C18H23BrO2
Mol. Mass.351.278
SMILESCOc1cc(CC2C(=C)C=C(C)CC2(C)C)c(O)cc1Br