Reaction Details
TargetProgesterone receptor
LigandBDBM50049513
Substrate/Competitorn/a
Meas. Tech.ChEMBL_159731 (CHEMBL766188)
Ki 71±n/a nM
Citation Hamann, LGFarmer, LJJohnson, MGBender, SLMais, DEWang, MWCrombie, DGoldman, MEJones, TK Synthesis and biological activity of novel nonsteroidal progesterone receptor antagonists based on cyclocymopol monomethyl ether. J Med Chem39:1778-89 (1996) 
 
Progesterone receptor
Name:Progesterone receptor
Type:Protein
Mol. Mass.:98979.52
Organism:Homo sapiens (Human)
Description:P06401
Residue:933
BDBM50049513
NameBDBM50049513
Synonyms:5-Bromo-4-methoxy-2-((1R,2S)-2-methyl-6-methylene-cyclohexylmethyl)-phenol | CHEMBL299778
TypeSmall organic molecule
Emp. Form.C16H21BrO2
Mol. Mass.325.241
SMILESCOc1cc(C[C@@H]2[C@@H](C)CCCC2=C)c(O)cc1Br