Reaction Details
TargetProgesterone receptor
LigandBDBM50049508
Substrate/Competitorn/a
Meas. Tech.ChEMBL_159731 (CHEMBL766188)
Ki 22±n/a nM
Citation Hamann, LGFarmer, LJJohnson, MGBender, SLMais, DEWang, MWCrombie, DGoldman, MEJones, TK Synthesis and biological activity of novel nonsteroidal progesterone receptor antagonists based on cyclocymopol monomethyl ether. J Med Chem39:1778-89 (1996) 
 
Progesterone receptor
Name:Progesterone receptor
Type:Protein
Mol. Mass.:98979.52
Organism:Homo sapiens (Human)
Description:P06401
Residue:933
BDBM50049508
NameBDBM50049508
Synonyms:5-Bromo-4-methoxy-2-((1S,4R)-2,2,4-trimethyl-6-methylene-cyclohexylmethyl)-phenol CHEMBL53549
TypeSmall organic molecule
Emp. Form.C18H25BrO2
Mol. Mass.353.294
SMILESCOc1cc(C[C@@H]2C(=C)C[C@H](C)CC2(C)C)c(O)cc1Br