Reaction Details
TargetProgesterone receptor
LigandBDBM50049486
Substrate/Competitorn/a
Meas. Tech.ChEMBL_159731 (CHEMBL766188)
Ki 54±n/a nM
Citation Hamann, LGFarmer, LJJohnson, MGBender, SLMais, DEWang, MWCrombie, DGoldman, MEJones, TK Synthesis and biological activity of novel nonsteroidal progesterone receptor antagonists based on cyclocymopol monomethyl ether. J Med Chem39:1778-89 (1996) 
 
Progesterone receptor
Name:Progesterone receptor
Type:Protein
Mol. Mass.:98979.52
Organism:Homo sapiens (Human)
Description:P06401
Residue:933
BDBM50049486
NameBDBM50049486
Synonyms:1-Nitro-4-(4,6,6-trimethyl-2-methylene-cyclohex-3-enylmethyl)-benzene | CHEMBL50023
TypeSmall organic molecule
Emp. Form.C17H21NO2
Mol. Mass.271.3541
SMILESCC1=CC(=C)C(Cc2ccc(cc2)[N+]([O-])=O)C(C)(C)C1