Reaction Details
TargetProgesterone receptor
LigandBDBM50049487
Substrate/Competitorn/a
Meas. Tech.ChEMBL_159731 (CHEMBL766188)
Ki 109±n/a nM
Citation Hamann, LGFarmer, LJJohnson, MGBender, SLMais, DEWang, MWCrombie, DGoldman, MEJones, TK Synthesis and biological activity of novel nonsteroidal progesterone receptor antagonists based on cyclocymopol monomethyl ether. J Med Chem39:1778-89 (1996) 
 
Progesterone receptor
Name:Progesterone receptor
Type:Protein
Mol. Mass.:98979.52
Organism:Homo sapiens (Human)
Description:P06401
Residue:933
BDBM50049487
NameBDBM50049487
Synonyms:5-Bromo-4-methoxy-2-(2,6,6-trimethyl-4-methylene-cyclohex-2-enylmethyl)-phenol | CHEMBL299828
TypeSmall organic molecule
Emp. Form.C18H23BrO2
Mol. Mass.351.278
SMILESCOc1cc(CC2C(C)=CC(=C)CC2(C)C)c(O)cc1Br