Reaction Details
TargetAndrogen receptor
LigandBDBM50049515
Substrate/Competitorn/a
Meas. Tech.ChEMBL_36143 (CHEMBL648331)
Ki 1.1±n/a nM
Citation Hamann, LGFarmer, LJJohnson, MGBender, SLMais, DEWang, MWCrombie, DGoldman, MEJones, TK Synthesis and biological activity of novel nonsteroidal progesterone receptor antagonists based on cyclocymopol monomethyl ether. J Med Chem39:1778-89 (1996) 
 
Androgen receptor
Name:Androgen receptor
Type:Receptor
Mol. Mass.:99185.27
Organism:Homo sapiens (Human)
Description:CHO cells were stably transfected with human AR gene.
Residue:920
BDBM50049515
NameBDBM50049515
Synonyms:(S)-4-Methylene-3-[2-[7a-methyl-1-((E)-1,4,5-trimethyl-hex-2-enyl)-octahydro-inden-(4E)-ylidene]-eth-(Z)-ylidene]-cyclohexanol | CHEMBL50241
TypeSmall organic molecule
Emp. Form.C28H44O
Mol. Mass.396.6484
SMILESCC(C)C(C)\C=C\C(C)C1CCC2\C(CCCC12C)=C\C=C1\C[C@@H](O)CCC1=C