Reaction Details
TargetMuscarinic acetylcholine receptor
LigandBDBM50176065
Substrate/Competitorn/a
Meas. Tech.ChEMBL_138316 (CHEMBL743827)
Ki 67±n/a nM
Citation Visser, TJvan Waarde, AJansen, TJVisser, GMvan der Mark, TWKraan, JEnsing, KVaalburg, W Stereoselective synthesis and biodistribution of potent [11C]-labeled antagonists for positron emission tomography imaging of muscarinic receptors in the airways. J Med Chem40:117-24 (1997) 
 
Muscarinic acetylcholine receptor
Name:Muscarinic acetylcholine receptor
Type:n/a
Mol. Mass.:66272.13
Organism:Cavia porcellus
Description:n/a
Residue:587
BDBM50176065
NameBDBM50176065
Synonyms:4-DAMP Acetic acid 4-[(4-acetoxy-phenyl)-pyridin-2-yl-methyl]-phenyl ester CHEMBL76897
TypeSmall organic molecule
Emp. Form.C21H26NO2
Mol. Mass.324.4361
SMILESC[N+]1(C)CCC(CC1)OC(=O)C(c1ccccc1)c1ccccc1