Reaction Details
TargetGlycogen phosphorylase, brain form
LigandBDBM50057754
Substrate/Competitorn/a
Meas. Tech.ChEMBL_70987 (CHEMBL680565)
Ki 3000±n/a nM
Citation Pastor, MCruciani, GClementi, S Smart region definition: a new way to improve the predictive ability and interpretability of three-dimensional quantitative structure-activity relationships. J Med Chem40:1455-64 (1997) 
 
Glycogen phosphorylase, brain form
Name:Glycogen phosphorylase, brain form
Type:PROTEIN
Mol. Mass.:96699.35
Organism:Homo sapiens (Human)
Description:ChEMBL_70998
Residue:843
BDBM50057754
NameBDBM50057754
Synonyms:8,9,10-Trihydroxy-7-hydroxymethyl-6-oxa-1,3-diaza-spiro[4.5]decane-2,4-dione | CHEMBL287432
TypeSmall organic molecule
Emp. Form.C8H12N2O7
Mol. Mass.248.1901
SMILESOCC1OC2(NC(=O)NC2=O)C(O)C(O)C1O