Reaction Details
TargetD(1A) dopamine receptor
LigandBDBM50057848
Substrate/Competitorn/a
Meas. Tech.ChEMBL_59009 (CHEMBL668873)
Ki 12±n/a nM
Citation Michaelides, MRHong, YDiDomenico, SBayburt, EKAsin, KEBritton, DRLin, CWShiosaki, K Substituted hexahydrobenzo[f]thieno[c]quinolines as dopamine D1-selective agonists: synthesis and biological evaluation in vitro and in vivo. J Med Chem40:1585-99 (1997) 
 
D(1A) dopamine receptor
Name:D(1A) dopamine receptor
Type:Enzyme Catalytic Domain
Mol. Mass.:49429.75
Organism:RAT
Description:P18901
Residue:446
BDBM50057848
NameBDBM50057848
Synonyms:(5aS,11bR)-2-Chloro-4,5,5a,6,7,11b-hexahydro-3-thia-5-aza-cyclopenta[c]phenanthrene-9,10-diol | CHEMBL39266
TypeSmall organic molecule
Emp. Form.C15H14ClNO2S
Mol. Mass.307.795
SMILESOc1cc2CC[C@@H]3NCc4sc(Cl)cc4[C@H]3c2cc1O