Reaction Details
TargetD(2) dopamine receptor
LigandBDBM50057850
Substrate/Competitorn/a
Meas. Tech.ChEMBL_61448 (CHEMBL670674)
Ki 540±n/a nM
Citation Michaelides, MRHong, YDiDomenico, SBayburt, EKAsin, KEBritton, DRLin, CWShiosaki, K Substituted hexahydrobenzo[f]thieno[c]quinolines as dopamine D1-selective agonists: synthesis and biological evaluation in vitro and in vivo. J Med Chem40:1585-99 (1997) 
 
D(2) dopamine receptor
Name:D(2) dopamine receptor
Type:G Protein-Coupled Receptor (GPCR)
Mol. Mass.:50931.60
Organism:Rattus norvegicus (rat)
Description:P61169
Residue:444
BDBM50057850
NameBDBM50057850
Synonyms:(5aS,11bS)-2-Hexyl-4,5,5a,6,7,11b-hexahydro-1-thia-5-aza-cyclopenta[c]phenanthrene-9,10-diol | CHEMBL289927
TypeSmall organic molecule
Emp. Form.C21H27NO2S
Mol. Mass.357.51
SMILESCCCCCCc1cc2CN[C@H]3CCc4cc(O)c(O)cc4[C@@H]3c2s1