Reaction Details
TargetD(1A) dopamine receptor
LigandBDBM50033116
Substrate/Competitorn/a
Meas. Tech.ChEMBL_59009 (CHEMBL668873)
Ki 30±n/a nM
Citation Michaelides, MRHong, YDiDomenico, SBayburt, EKAsin, KEBritton, DRLin, CWShiosaki, K Substituted hexahydrobenzo[f]thieno[c]quinolines as dopamine D1-selective agonists: synthesis and biological evaluation in vitro and in vivo. J Med Chem40:1585-99 (1997) 
 
D(1A) dopamine receptor
Name:D(1A) dopamine receptor
Type:Enzyme Catalytic Domain
Mol. Mass.:49429.75
Organism:RAT
Description:P18901
Residue:446
BDBM50033116
NameBDBM50033116
Synonyms:(1R,3S)-3-Adamantan-1-yl-1-aminomethyl-isochroman-5,6-diol CHEMBL291143 | cid_6603703
TypeSmall organic molecule
Emp. Form.C20H27NO3
Mol. Mass.329.4333
SMILESNC[C@@H]1O[C@@H](Cc2c(O)c(O)ccc12)C12CC3CC(CC(C3)C1)C2