Reaction Details
TargetAntithrombin-III
LigandBDBM50369253
Substrate/Competitorn/a
Meas. Tech.ChEMBL_35868 (CHEMBL652036)
Kd 7±n/a nM
Citation Petitou, MDuchaussoy, PJaurand, GGourvenec, FLederman, IStrassel, JMBârzu, TCrépon, BHérault, JPLormeau, JCBernat, AHerbert, JM Synthesis and pharmacological properties of a close analogue of an antithrombotic pentasaccharide (SR 90107A/ORG 31540). J Med Chem40:1600-7 (1997) 
 
Antithrombin-III
Name:Antithrombin-III
Type:PROTEIN
Mol. Mass.:52602.34
Organism:Homo sapiens (Human)
Description:ChEMBL_35871
Residue:464
BDBM50369253
NameBDBM50369253
Synonyms:CHEMBL1909451
TypeSmall organic molecule
Emp. Form.C37H54N2O50S8
Mol. Mass.1583.334
SMILESCO[C@@H]1O[C@H](COS([O-])(=O)=O)[C@@H](O[C@H]2O[C@H]([C@H](O[C@@H]3O[C@H](COS([O-])(=O)=O)[C@@H](O[C@H]4O[C@@H]([C@@H](O[C@@H]5O[C@@H](COS([O-])(=O)=O)[C@H](OC)[C@@H](OC)[C@@H]5NS([O-])(=O)=O)[C@@H](OC)[C@@H]4OC)C([O-])=O)[C@@H](OS([O-])(=O)=O)[C@@H]3OS([O-])(=O)=O)[C@@H](OC)[C@@H]2OS([O-])(=O)=O)C([O-])=O)[C@H](OC)[C@H]1NS([O-])(=O)=O