Reaction Details
TargetDelta-type opioid receptor
LigandBDBM50058152
Substrate/Competitorn/a
Meas. Tech.ChEMBL_147345 (CHEMBL873918)
Ki 0.250000±n/a nM
Citation Ohkawa, SDiGiacomo, BLarson, DLTakemori, AEPortoghese, PS 7-Spiroindanyl derivatives of naltrexone and oxymorphone as selective ligands for delta opioid receptors. J Med Chem40:1720-5 (1997) 
 
Delta-type opioid receptor
Name:Delta-type opioid receptor
Type:G Protein-Coupled Receptor (GPCR)
Mol. Mass.:40382.98
Organism:Homo sapiens (Human)
Description:Competition binding assays were carried out using membrane preparations from transfected HN9.10 cells that constitutively expressed the delta opioid receptor.
Residue:372
BDBM50058152
NameBDBM50058152
Synonyms:7-(2''-spiroindanyl)naltrexone | CHEMBL610293
TypeSmall organic molecule
Emp. Form.C28H29NO4
Mol. Mass.443.5342
SMILES[H][C@@]12Oc3c4c(C[C@@]5([H])N(CC6CC6)CC[C@@]14[C@@]5(O)CC1(Cc4ccccc4C1)C2=O)ccc3O