Reaction Details
TargetMu-type opioid receptor
LigandBDBM50058153
Substrate/Competitorn/a
Meas. Tech.ChEMBL_148519 (CHEMBL758129)
Ki 125±n/a nM
Citation Ohkawa, SDiGiacomo, BLarson, DLTakemori, AEPortoghese, PS 7-Spiroindanyl derivatives of naltrexone and oxymorphone as selective ligands for delta opioid receptors. J Med Chem40:1720-5 (1997) 
 
Mu-type opioid receptor
Name:Mu-type opioid receptor
Type:Enzyme Catalytic Domain
Mol. Mass.:44431.62
Organism:MOUSE
Description:OPIATE Mu OPRM1 MOUSE::P42866
Residue:398
BDBM50058153
NameBDBM50058153
Synonyms:7-(5',6'-Benzo-2'-spiroindanyl)oxymorphone | CHEMBL297470
TypeSmall organic molecule
Emp. Form.C29H27NO4
Mol. Mass.453.529
SMILESCN1CCC23C4Oc5c2c(CC1[C@]3(O)CC1(Cc2cc3ccccc3cc2C1)C4=O)ccc5O