Reaction Details
TargetcGMP-dependent 3',5'-cyclic phosphodiesterase
LigandBDBM50034908
Substrate/Competitorn/a
Meas. Tech.ChEMBL_156333 (CHEMBL760135)
Ki 2800±n/a nM
Citation Bourguignon, JJDésaubry, LRaboisson, PWermuth, CGLugnier, C 9-Benzyladenines: potent and selective cAMP phosphodiesterase inhibitors. J Med Chem40:1768-70 (1997) 
 
cGMP-dependent 3',5'-cyclic phosphodiesterase
Name:cGMP-dependent 3',5'-cyclic phosphodiesterase
Type:Enzyme Catalytic Domain
Mol. Mass.:105691.58
Organism:Homo sapiens (Human)
Description:O00408
Residue:941
BDBM50034908
NameBDBM50034908
Synonyms:(2R,3S)-3-((R)-6-Amino-purin-9-yl)-nonan-2-ol (2R,3S)-3-(6-amino-9H-purin-9-yl)nonan-2-ol 3-(6-Amino-purin-9-yl)-nonan-2-ol CHEMBL50378
TypeSmall organic molecule
Emp. Form.C14H23N5O
Mol. Mass.277.3653
SMILESCCCCCC[C@@H]([C@@H](C)O)n1cnc2c(N)ncnc12