Reaction Details
TargetNeutrophil elastase
LigandBDBM50058353
Substrate/Competitorn/a
Meas. Tech.ChEMBL_63997 (CHEMBL673106)
Ki 2.3±n/a nM
Citation Edwards, PDAndisik, DWBryant, CAEwing, BGomes, BLewis, JJRakiewicz, DSteelman, GStrimpler, ATrainor, DATuthill, PAMauger, RCVeale, CAWildonger, RAWilliams, JCWolanin, DJZottola, M Discovery and biological activity of orally active peptidyl trifluoromethyl ketone inhibitors of human neutrophil elastase. J Med Chem40:1876-85 (1997) 
 
Neutrophil elastase
Name:Neutrophil elastase
Type:Enzyme
Mol. Mass.:28532.38
Organism:Homo sapiens (Human)
Description:P08246
Residue:267
BDBM50058353
NameBDBM50058353
Synonyms:1-[(S)-3-Methyl-2-(4-methylsulfanyl-benzoylamino)-butyryl]-pyrrolidine-2-carboxylic acid (3,3,3-trifluoro-1-isopropyl-2-oxo-propyl)-amide | CHEMBL55161
TypeSmall organic molecule
Emp. Form.C24H32F3N3O4S
Mol. Mass.515.589
SMILESCSc1ccc(cc1)C(=O)N[C@@H](C(C)C)C(=O)N1CCCC1C(=O)NC(C(C)C)C(=O)C(F)(F)F