Reaction Details
TargetNeutrophil elastase
LigandBDBM50058360
Substrate/Competitorn/a
Meas. Tech.ChEMBL_63997 (CHEMBL673106)
Ki 10±n/a nM
Citation Edwards, PDAndisik, DWBryant, CAEwing, BGomes, BLewis, JJRakiewicz, DSteelman, GStrimpler, ATrainor, DATuthill, PAMauger, RCVeale, CAWildonger, RAWilliams, JCWolanin, DJZottola, M Discovery and biological activity of orally active peptidyl trifluoromethyl ketone inhibitors of human neutrophil elastase. J Med Chem40:1876-85 (1997) 
 
Neutrophil elastase
Name:Neutrophil elastase
Type:Enzyme
Mol. Mass.:28532.38
Organism:Homo sapiens (Human)
Description:P08246
Residue:267
BDBM50058360
NameBDBM50058360
Synonyms:4-(3-{(S)-2-Methyl-1-[2-(3,3,3-trifluoro-1-isopropyl-2-oxo-propylcarbamoyl)-pyrrolidine-1-carbonyl]-propyl}-ureido)-benzoic acid | CHEMBL435774
TypeSmall organic molecule
Emp. Form.C24H31F3N4O6
Mol. Mass.528.5213
SMILESCC(C)[C@H](NC(=O)Nc1ccc(cc1)C(O)=O)C(=O)N1CCCC1C(=O)NC(C(C)C)C(=O)C(F)(F)F