Reaction Details
TargetNeutrophil elastase
LigandBDBM50058372
Substrate/Competitorn/a
Meas. Tech.ChEMBL_63997 (CHEMBL673106)
Ki 5.4±n/a nM
Citation Edwards, PDAndisik, DWBryant, CAEwing, BGomes, BLewis, JJRakiewicz, DSteelman, GStrimpler, ATrainor, DATuthill, PAMauger, RCVeale, CAWildonger, RAWilliams, JCWolanin, DJZottola, M Discovery and biological activity of orally active peptidyl trifluoromethyl ketone inhibitors of human neutrophil elastase. J Med Chem40:1876-85 (1997) 
 
Neutrophil elastase
Name:Neutrophil elastase
Type:Enzyme
Mol. Mass.:28532.38
Organism:Homo sapiens (Human)
Description:P08246
Residue:267
BDBM50058372
NameBDBM50058372
Synonyms:CHEMBL292141 | N-(2-Dimethylamino-ethyl)-N'-{(S)-2-methyl-1-[2-(3,3,3-trifluoro-1-isopropyl-2-oxo-propylcarbamoyl)-pyrrolidine-1-carbonyl]-propyl}-terephthalamide
TypeSmall organic molecule
Emp. Form.C28H40F3N5O5
Mol. Mass.583.6429
SMILESCC(C)[C@H](NC(=O)c1ccc(cc1)C(=O)NCCN(C)C)C(=O)N1CCCC1C(=O)NC(C(C)C)C(=O)C(F)(F)F