Reaction Details
TargetNeutrophil elastase
LigandBDBM50058391
Substrate/Competitorn/a
Meas. Tech.ChEMBL_63997 (CHEMBL673106)
Ki 1.9±n/a nM
Citation Edwards, PDAndisik, DWBryant, CAEwing, BGomes, BLewis, JJRakiewicz, DSteelman, GStrimpler, ATrainor, DATuthill, PAMauger, RCVeale, CAWildonger, RAWilliams, JCWolanin, DJZottola, M Discovery and biological activity of orally active peptidyl trifluoromethyl ketone inhibitors of human neutrophil elastase. J Med Chem40:1876-85 (1997) 
 
Neutrophil elastase
Name:Neutrophil elastase
Type:Enzyme
Mol. Mass.:28532.38
Organism:Homo sapiens (Human)
Description:P08246
Residue:267
BDBM50058391
NameBDBM50058391
Synonyms:(S)-1-[(S)-2-(4-Methoxy-benzoylamino)-3-methyl-butyryl]-pyrrolidine-2-carboxylic acid ((S)-3,3,3-trifluoro-1-isopropyl-2-oxo-propyl)-amide | CHEMBL55210
TypeSmall organic molecule
Emp. Form.C24H32F3N3O5
Mol. Mass.499.5232
SMILESCOc1ccc(cc1)C(=O)N[C@@H](C(C)C)C(=O)N1CCC[C@H]1C(=O)N[C@@H](C(C)C)C(=O)C(F)(F)F