Reaction Details
TargetNitric oxide synthase, endothelial
LigandBDBM50058442
Substrate/Competitorn/a
Meas. Tech.ChEMBL_65317 (CHEMBL678090)
Ki 3100±n/a nM
Citation Shearer, BGLee, SOplinger, JAFrick, LWGarvey, EPFurfine, ES Substituted N-phenylisothioureas: potent inhibitors of human nitric oxide synthase with neuronal isoform selectivity. J Med Chem40:1901-5 (1997) 
 
Nitric oxide synthase, endothelial
Name:Nitric oxide synthase, endothelial
Type:Enzyme Catalytic Domain
Mol. Mass.:133297.84
Organism:Homo sapiens (Human)
Description:P29474
Residue:1203
BDBM50058442
NameBDBM50058442
Synonyms:2-Ethyl-1-(3-methoxy-phenyl)-isothiourea; hydriodide CHEMBL553216
TypeSmall organic molecule
Emp. Form.C10H14N2OS
Mol. Mass.210.296
SMILESCCSC(N)=Nc1cccc(OC)c1