Reaction Details
TargetNitric oxide synthase, brain
LigandBDBM50058441
Substrate/Competitorn/a
Meas. Tech.ChEMBL_143376 (CHEMBL880847)
Ki 170±n/a nM
Citation Shearer, BGLee, SOplinger, JAFrick, LWGarvey, EPFurfine, ES Substituted N-phenylisothioureas: potent inhibitors of human nitric oxide synthase with neuronal isoform selectivity. J Med Chem40:1901-5 (1997) 
 
Nitric oxide synthase, brain
Name:Nitric oxide synthase, brain
Type:Homodimer
Mol. Mass.:160985.98
Organism:Homo sapiens (Human)
Description:P29475
Residue:1434
BDBM50058441
NameBDBM50058441
Synonyms:1-(2-Chloro-phenyl)-2-ethyl-isothiourea; hydrochloride CHEMBL541296
TypeSmall organic molecule
Emp. Form.C9H11ClN2S
Mol. Mass.214.715
SMILESCCSC(N)=Nc1ccccc1Cl