Reaction Details
TargetNitric oxide synthase, brain
LigandBDBM50058451
Substrate/Competitorn/a
Meas. Tech.ChEMBL_143376 (CHEMBL880847)
Ki 330±n/a nM
Citation Shearer, BGLee, SOplinger, JAFrick, LWGarvey, EPFurfine, ES Substituted N-phenylisothioureas: potent inhibitors of human nitric oxide synthase with neuronal isoform selectivity. J Med Chem40:1901-5 (1997) 
 
Nitric oxide synthase, brain
Name:Nitric oxide synthase, brain
Type:Homodimer
Mol. Mass.:160985.98
Organism:Homo sapiens (Human)
Description:P29475
Residue:1434
BDBM50058451
NameBDBM50058451
Synonyms:2-Ethyl-1-(4-isopropyl-phenyl)-isothiourea; hydrochloride CHEMBL553038
TypeSmall organic molecule
Emp. Form.C12H18N2S
Mol. Mass.222.35
SMILESCCSC(N)=Nc1ccc(cc1)C(C)C