Reaction Details
TargetNitric oxide synthase, brain
LigandBDBM50058459
Substrate/Competitorn/a
Meas. Tech.ChEMBL_143376 (CHEMBL880847)
Ki 120±n/a nM
Citation Shearer, BGLee, SOplinger, JAFrick, LWGarvey, EPFurfine, ES Substituted N-phenylisothioureas: potent inhibitors of human nitric oxide synthase with neuronal isoform selectivity. J Med Chem40:1901-5 (1997) 
 
Nitric oxide synthase, brain
Name:Nitric oxide synthase, brain
Type:Homodimer
Mol. Mass.:160985.98
Organism:Homo sapiens (Human)
Description:P29475
Residue:1434
BDBM50058459
NameBDBM50058459
Synonyms:2-Ethyl-1-phenyl-isothiourea; hydriodide CHEMBL545673
TypeSmall organic molecule
Emp. Form.C9H12N2S
Mol. Mass.180.27
SMILESCCSC(N)=Nc1ccccc1