Reaction Details
TargetNitric oxide synthase, brain
LigandBDBM50058457
Substrate/Competitorn/a
Meas. Tech.ChEMBL_143376 (CHEMBL880847)
Ki 3300±n/a nM
Citation Shearer, BGLee, SOplinger, JAFrick, LWGarvey, EPFurfine, ES Substituted N-phenylisothioureas: potent inhibitors of human nitric oxide synthase with neuronal isoform selectivity. J Med Chem40:1901-5 (1997) 
 
Nitric oxide synthase, brain
Name:Nitric oxide synthase, brain
Type:Homodimer
Mol. Mass.:160985.98
Organism:Homo sapiens (Human)
Description:P29475
Residue:1434
BDBM50058457
NameBDBM50058457
Synonyms:2-Methyl-1-(4-nitro-phenyl)-isothiourea; hydriodide | CHEMBL542857
TypeSmall organic molecule
Emp. Form.C8H9N3O2S
Mol. Mass.211.241
SMILESCS\C([NH-])=[NH+]\c1ccc(cc1)[N+]([O-])=O