Reaction Details
TargetNitric oxide synthase, inducible
LigandBDBM50058441
Substrate/Competitorn/a
Meas. Tech.ChEMBL_89177 (CHEMBL700496)
Ki 2900±n/a nM
Citation Shearer, BGLee, SOplinger, JAFrick, LWGarvey, EPFurfine, ES Substituted N-phenylisothioureas: potent inhibitors of human nitric oxide synthase with neuronal isoform selectivity. J Med Chem40:1901-5 (1997) 
 
Nitric oxide synthase, inducible
Name:Nitric oxide synthase, inducible
Type:Homodimer
Mol. Mass.:131141.95
Organism:Homo sapiens (Human)
Description:P35228
Residue:1153
BDBM50058441
NameBDBM50058441
Synonyms:1-(2-Chloro-phenyl)-2-ethyl-isothiourea; hydrochloride CHEMBL541296
TypeSmall organic molecule
Emp. Form.C9H11ClN2S
Mol. Mass.214.715
SMILESCCSC(N)=Nc1ccccc1Cl