Reaction Details
TargetNitric oxide synthase, inducible
LigandBDBM50058442
Substrate/Competitorn/a
Meas. Tech.ChEMBL_89177 (CHEMBL700496)
Ki 3200±n/a nM
Citation Shearer, BGLee, SOplinger, JAFrick, LWGarvey, EPFurfine, ES Substituted N-phenylisothioureas: potent inhibitors of human nitric oxide synthase with neuronal isoform selectivity. J Med Chem40:1901-5 (1997) 
 
Nitric oxide synthase, inducible
Name:Nitric oxide synthase, inducible
Type:Homodimer
Mol. Mass.:131141.95
Organism:Homo sapiens (Human)
Description:P35228
Residue:1153
BDBM50058442
NameBDBM50058442
Synonyms:2-Ethyl-1-(3-methoxy-phenyl)-isothiourea; hydriodide CHEMBL553216
TypeSmall organic molecule
Emp. Form.C10H14N2OS
Mol. Mass.210.296
SMILESCCSC(N)=Nc1cccc(OC)c1