Reaction Details
TargetNitric oxide synthase, brain
LigandBDBM50058468
Substrate/Competitorn/a
Meas. Tech.ChEMBL_143376 (CHEMBL880847)
Ki 210±n/a nM
Citation Shearer, BGLee, SOplinger, JAFrick, LWGarvey, EPFurfine, ES Substituted N-phenylisothioureas: potent inhibitors of human nitric oxide synthase with neuronal isoform selectivity. J Med Chem40:1901-5 (1997) 
 
Nitric oxide synthase, brain
Name:Nitric oxide synthase, brain
Type:Homodimer
Mol. Mass.:160985.98
Organism:Homo sapiens (Human)
Description:P29475
Residue:1434
BDBM50058468
NameBDBM50058468
Synonyms:1-(4-Benzyloxy-phenyl)-2-ethyl-isothiourea; hydriodide CHEMBL540280
TypeSmall organic molecule
Emp. Form.C16H18N2OS
Mol. Mass.286.392
SMILESCCSC(N)=Nc1ccc(OCc2ccccc2)cc1